Error in workflow(WS20000050)

10-11  Source: Network gathering  Views:1 

Advertisement
Workflow : WS20000050
Object type : BUS2089
Mail not trigger after raise trip.
Getting below errors in log.Plz help
BUS2089 binding
&_EVT_OBJECT&       &TRIP&
&_EVT_CREATOR&    &_WF_INITIATOR&
Error when starting work item 000000434152
Error when processing node '0000000464' (ParForEach index 000000)
Error when creating a component of type 'Wait Step'
Error within method CL_SWF_RUN_WIM_EVENT->_GET_INIT_WORKITEM_CONTAINER
Workflow 000000434152 wait step 0000000464: No valid object ID in container element 'Trip'
Error when creating an event item
Edited by: sk2789 on May 14, 2010 8:21 AM
Hi,
Were you able to activate this workflow. If you have, please let me know the steps for the same.
Regards.
Related articles
  • Error in workflow(WS20000050) 10-11

    Workflow : WS20000050 Object type : BUS2089 Mail not trigger after raise trip. Getting below errors in log.Plz help BUS2089 binding &_EVT_OBJECT&       &TRIP& &_EVT_CREATOR&    &_WF_INITIATOR& Error when starting work item

  • Error in workflow while linking goods receipt document with parked invoice 10-11

    Hi All, I parked document using Tcode MIRO, when WF has been executed and goods receipt document has been created.At the time that we tried to link this goods receipt to parked invoice document in the workflow,The problem happens with work item sayin

  • Error in Workflow for PR Overall Release 10-11

    Dear SAP Fans, I am getting error in workflow (WS20000077) after release of Purchase Requisition with first person and getting message in OutBox with the following errors and is unable to go to next person's Inbox for release PR.    Error when creati

  • Error on Workflow email notification in oracle 11.5.10.2 11-30

    Anyone seen similiar error on Workflow email notification in oracle 11.5.10.2 UNEXPECTED:[fnd.wf.bes.server.SystemLoader.getLocalSystem]:Caching disabled due to JTF exception: oracle.apps.jtf.base.resources.FrameworkException: CacheComponent not regi

  • Error handling workflow not getting triggered 11-30

    Hi all, I'm creating a outbound IDoc. And for error handling workflow.. I created a organization structure in PPOME and assigned users. I gave this position number thus created in the partner profile in post processing permitted agent tab. But when t

  • Error in Workflow JTFTASK 11-30

    Hi, Ours is 11.5.10.2 version. Once we login to Oracle applications, above of responsibility list. we see some messages like "Error in Workflow JTFTASK /20991-10881 3205: 'AASTML' is not a valid role or user name. ". From where it's generating t

  • No way to publish a workflow, I get this error: System.InvalidOperationException: Operation failed with error Microsoft.Workflow.Client.ScopeInactiveException: Scope ... is not in an active state. Its current state is 'Unregistering' 11-30

    Hi, I'm using Project Server 2013 and I'm not able to publish a workflow in SharePoint Designer 2013, I get this error: System.InvalidOperationException: Operation failed with error Microsoft.Workflow.Client.ScopeInactiveException: Scope '/SharePoint

  • Error in Workflow for Parked Document (FV60) 11-30

    Hi Workflow Experts, I have a FI document parking Workflow scenario which is 3 level release that is if the amount is upto 10000 first person will release if it's more than that upto 20000  then second user has to release ,if more than that then thir

  • Error in Workflow PAWFPPWP/24113 3205: 'APVR_PAWFPPWP24113' is not a valid 11-30

    Hi OS RHEL 5.5 Database 11.1.0.7.0 Applications R12.1.3 System error occured in the worklist, what is the cause and how to resolve it. Error in Workflow PAWFPPWP/24113 3205: 'APVR_PAWFPPWP24113' is not a valid role or user name. Rgrds, ShubhaHi, Do y

  • Error "Approval workflow fragment has no user assignment" 11-30

    Hi all, We are implementing the workflow for  n level approval of SC WS14000133.Now when we try to add adhoc approvers by clicking on the ADD APPROVER button,we get the foll error: "Approval workflow fragment has no user assignment". I have alre

  • LIBOVD ERROR  - "validateContextToken: workflow session was not found for given context. Create a new workflow session with token" 10-11

    Hello everyone, I have the following scenario: We're using "Oracle SOA Suite 11g 11.1.1.7.0" (Patched w/ 17893896) mainly for a BPM/Human workflow composite. Former, we were having the error bellow: <Mar 16, 2015 1:13:03 PM BRT> <Error&

  • Status error in workflow while changing personnel admin in pa30 10-11

    HI,   I have created a leave request in PA30, so that a workflow has to trigger, for personnel admin i am using custom rule for agent selection. I am following error in inbox instead of work item. Workflow 1712 set to status ERROR Please repair the s

  • Error: Microsoft.Workflow.Client.ActivityNotFoundException while deploying VS 2012 Workflow 10-11

    HI, I am trying to create a VS 2012 based SharePoint 2013 workflow. I added the workflow option. Under the sequence, i added a writetoHistory - "Started". I tried to deploy the workflow. I am getting the below error: Error 1: Error occurred in d

  • Error within Workflow calling a form 10-11

    Hey, I have made a workflow with a form getting some values, transmited to a WF attribute, then i call another form which use this value. First i used a subprocess to call the form and i had this error: "com.waveset.util.WavesetException: Suspended c

  • No data found for region error on Workflow notification page 10-11

    Hi ! For workflow, I have created a Non Form Function in Oracle Applications and linked the region to display in the notification. This region's type is StackLayout. I created an attribute of type Document and assigned it the value in the form JSP:/O

  • Error in Workflow wait for event node 10-11

    Hello Experts, I am working on one QM notification. I shall explain the scenario first: 1) User will take the usage decision on inspection lot in QA11. When user will take decision and save inspection lot BUS2045 event USAGEDECISIONMADE will be trigg

  • Error in workflow 20000075 10-11

    Hi Guys, I copied the standard workflow to a custom one and did all the necessary config. When I execute the workflow I get the following errors; Error when processing node '0000000093' (ParForEach index 000000) Work item 000000000059: Object FLOWITE

  • Agent determination for step 0000000081 failed error in workflow 10-11

    Hello All,      I am doing employment verification from ESS portal. In the workflow step I have selected RULE to determine the agent. To configure rule, I double click on rule, on next screen selected "Agent determination - responsibilties" to d

  • Error using Workflow API to retrieve result of closed instance. 10-11

    Hello, I have been attempting to use the workflow Java API to retrieve the payloads of open and completed instances of a particular BPEL Process. I have been able to use the IInstanceHandle.getField method to retrieve the payload of an active/open in

  • Error in Workflow log 10-11

    Hi All, I have got very little knowledge of workflows thus seeks the help from all of you. The problem is as folows. When I execute tcode SWI1 and click on any task it goes to the workflow log. When I click on the details of the workflow so the agent